请选择 进入手机版 | 继续访问电脑版
搜索

2

主题

4

帖子

67

积分

注册会员

Rank: 2

积分
67
发表于 2023-3-4 14:41:19 2373 浏览 0 回复

整体编译 Android4.4,不能通过。错误提示如下。请指导!

make[1]: Leaving directory `/home/topeet/imx6/iTOP-iMX6_android4.4.2/kernel_imx'
install kernel modules:  kernel_imx/drivers/net/wireless/rtl8723BU/8723bu.ko kernel_imx/net/wireless/cfg80211.ko
target thumb C++: content_content_common_gyp <= external/chromium_org/content/common/android/hash_set.cc
In file included from external/chromium_org/content/common/android/hash_set.cc:5:0:
out/target/product/topeet_6dq/obj/GYP/shared_intermediates/content/jni/HashSet_jni.h:10:26: error: extra tokens at end of #ifndef directive [-Werror]
out/target/product/topeet_6dq/obj/GYP/shared_intermediates/content/jni/HashSet_jni.h:11:26: error: missing whitespace after the macro name [-Werror]
In file included from external/chromium_org/content/common/android/hash_set.cc:5:0:
out/target/product/topeet_6dq/obj/GYP/shared_intermediates/content/jni/HashSet_jni.h:24:20: error: expected initializer before '<' token
out/target/product/topeet_6dq/obj/GYP/shared_intermediates/content/jni/HashSet_jni.h:26:17: error: expected initializer before '<' token
out/target/product/topeet_6dq/obj/GYP/shared_intermediates/content/jni/HashSet_jni.h:29:22: error: expected '{' before '<' token
out/target/product/topeet_6dq/obj/GYP/shared_intermediates/content/jni/HashSet_jni.h:29:22: error: expected unqualified-id before '<' token
external/chromium_org/content/common/android/hash_set.cc:30:1: error: expected '}' at end of input
cc1plus: all warnings being treated as errors
make: *** [out/target/product/topeet_6dq/obj/STATIC_LIBRARIES/content_content_common_gyp_intermediates/content/common/android/hash_set.o] Error 1


回复

使用道具 举报

返回列表
您需要登录后才可以回帖 登录 | 立即注册

本版积分规则

登录或注册

官方客服

QQ:2551456065

官方QQ群

195631883

扫一扫关注迅为公众号

群号652692981

 
快速回复 返回顶部 返回列表